BDBM50494903 CHEMBL3092603
SMILES [H][C@]12OC(=O)c3cc(OC)c(OC)c(OC)c3[C@]1([H])O[C@H](COC(=O)c1ccc(O)c(OC)c1)[C@@H](O)[C@@H]2O
InChI Key InChIKey=FDUGBWLAYRSJFX-WVIAUDPISA-N
Data  1 IC50
  Tab Delimited (TSV)   2D SDfile   Computed 3D by Vconf -m prep SDfile
Find this compound or compounds like it in BindingDB:
Activity Spreadsheet -- Enzyme Inhibition Constant Data from BindingDB
Found 1 hit for monomerid = 50494903
TargetPolyphenol oxidase 2(Agaricus bisporus (Common mushroom))
Kinki University
Curated by ChEMBL
LigandPNGBDBM50494903(CHEMBL3092603)
Affinity DataIC50: >1.00E+5nM. Assay description: Inhibition of mushroom tyrosinase using L-tyrosine as substrate preincubated for 10 mins followed by enzyme addition measured after 20 mins by microp...
Ligand InfoPC cidPC sid
In DepthDetails ArticlePubMed