BDBM50495749 CHEMBL3113965
SMILES CS(=O)(=O)Nc1cc(ccc1OCc1ccccc1)C(=O)O[C@@H](Cc1c(Cl)c[n+]([O-])cc1Cl)c1ccc(OC(F)F)c(OCC2CC2)c1
InChI Key InChIKey=IEUGAGUQAUJRBX-PMERELPUSA-N
Data  2 IC50
  Tab Delimited (TSV)   2D SDfile   Computed 3D by Vconf -m prep SDfile
Find this compound or compounds like it in BindingDB:
Activity Spreadsheet -- Enzyme Inhibition Constant Data from BindingDB
Found 2 hits for monomerid = 50495749
TargetcAMP-specific 3',5'-cyclic phosphodiesterase 4A/4B/4C/4D(Homo sapiens (Human))
Chiesi Farmaceutici
Curated by ChEMBL
LigandPNGBDBM50495749(CHEMBL3113965)
Affinity DataIC50:  0.530nM. Assay description: Inhibition of PDE4 activity in human PBMC assessed as inhibition of LPS-induced TNFalpha release after 18 hrs by ELISA
Ligand InfoPC cidPC sid
In DepthDetails ArticlePubMed
TargetcAMP-specific 3',5'-cyclic phosphodiesterase 4A/4B/4C/4D(Homo sapiens (Human))
Chiesi Farmaceutici
Curated by ChEMBL
LigandPNGBDBM50495749(CHEMBL3113965)
Affinity DataIC50:  0.320nM. Assay description: Inhibition of PDE4 isolated from human U937 cells assessed as reduction in cAMP level by LANCE assay
Ligand InfoPC cidPC sid
In DepthDetails ArticlePubMed