BDBM50496878 CHEMBL3228293
SMILES CCOC(=O)C1(CCN(CCC#N)CC1)c1ccccc1
InChI Key InChIKey=GLLYOSSOZQFJJJ-UHFFFAOYSA-N
Data  1 EC50
  Tab Delimited (TSV)   2D SDfile   Computed 3D by Vconf -m prep SDfile
Find this compound or compounds like it in BindingDB:
Activity Spreadsheet -- Enzyme Inhibition Constant Data from BindingDB
Found 1 hit for monomerid = 50496878
TargetDelta-type/Kappa-type/Mu-type opioid receptor(Rattus norvegicus (rat))
TBA
Curated by ChEMBL
LigandPNGBDBM50496878(CHEMBL3228293)
Affinity DataEC50:  8.00E+3nM. Assay description: Displacement of radiolabeled dihydromorphine from opioid receptor in rat brain homogenates
Ligand InfoPC cidPC sid
In DepthDetails ArticlePubMed