BDBM50497038 CHEMBL3248388
SMILES C([C@@H]1COc2ccccc2O1)N1CCN(C[C@@H]2COc3ccccc3O2)CC1
InChI Key InChIKey=PDDQPUUOEBGDSN-QZTJIDSGSA-N
Data  1 Kd
  Tab Delimited (TSV)   2D SDfile   Computed 3D by Vconf -m prep SDfile
Find this compound or compounds like it in BindingDB:
Activity Spreadsheet -- Enzyme Inhibition Constant Data from BindingDB
Found 1 hit for monomerid = 50497038
LigandPNGBDBM50497038(CHEMBL3248388)
Affinity DataKd:  562nM. Assay description: Displacement of [3H]dihydroazapetine from alpha-adrenoreceptor in rat vas deferens
Ligand InfoPC cidPC sid
In DepthDetails ArticlePubMed