BDBM50497048 CHEMBL3246767
SMILES CC(C)(C)NCC(O)COc1cccc2CC=CCc12
InChI Key InChIKey=JDOKKQREDFLVNP-UHFFFAOYSA-N
Data  1 IC50
  Tab Delimited (TSV)   2D SDfile   Computed 3D by Vconf -m prep SDfile
Find this compound or compounds like it in BindingDB:
Activity Spreadsheet -- Enzyme Inhibition Constant Data from BindingDB
Found 1 hit for monomerid = 50497048
TargetBeta-1/Beta-2/Beta-3 adrenergic receptor(Rattus norvegicus (Rat))
TBA
Curated by ChEMBL
LigandPNGBDBM50497048(CHEMBL3246767)
Affinity DataIC50:  0.00130nM. Assay description: Inhibition of beta-adrenergic receptor in rat portal vein
Ligand InfoPC cidPC sid
In DepthDetails ArticlePubMed