BDBM50497347 CHEMBL1529478
SMILES FC(F)(F)c1ccccc1-c1nc(NCc2cccs2)c2ccccc2n1
InChI Key InChIKey=QBDAEJRHUCSSPR-UHFFFAOYSA-N
Data  6 IC50
  Tab Delimited (TSV)   2D SDfile   Computed 3D by Vconf -m prep SDfile
Find this compound or compounds like it in BindingDB:
Activity Spreadsheet -- Enzyme Inhibition Constant Data from BindingDB
Found 6 hits for monomerid = 50497347
TargetWD repeat-containing protein 48(Homo sapiens (Human))
National Center For Advancing Translational Sciences
Curated by ChEMBL
LigandPNGBDBM50497347(CHEMBL1529478)
Affinity DataIC50:  7.90E+3nM. Assay description: Inhibition of human USP1/UAF1 using Ub-AMC substrate by fluorescence assay
In DepthDetails ArticlePubMed
TargetPhosphatidylinositol 5-phosphate 4-kinase type-2 gamma(Homo sapiens (Human))
Dana-Farber Cancer Institute
Curated by ChEMBL
LigandPNGBDBM50497347(CHEMBL1529478)
Affinity DataIC50:  1.00E+3nM. Assay description: Inhibition of PI5P4Kgamma (unknown origin)
In DepthDetails ArticlePubMed
TargetPhosphatidylinositol 5-phosphate 4-kinase type-2 gamma(Homo sapiens (Human))
Dana-Farber Cancer Institute
Curated by ChEMBL
LigandPNGBDBM50497347(CHEMBL1529478)
Affinity DataIC50:  2.00E+3nM. Assay description: Inhibition of GST-fused human recombinant PI5P4Kgamma expressed in Escherichia coli BL21 (DE3) using dipalmitoyl-PI5P and [gamma-32P]ATP as substrate...
In DepthDetails ArticlePubMed
TargetPhosphatidylinositol 5-phosphate 4-kinase type-2 alpha(Homo sapiens)
University Of Cambridge
Curated by ChEMBL
LigandPNGBDBM50497347(CHEMBL1529478)
Affinity DataIC50: <5.01E+4nM. Assay description: Inhibition of PI5P4Kalpha (unknown origin) by ADP-Glo assay
In DepthDetails ArticlePubMed
TargetPhosphatidylinositol 5-phosphate 4-kinase type-2 alpha(Homo sapiens)
University Of Cambridge
Curated by ChEMBL
LigandPNGBDBM50497347(CHEMBL1529478)
Affinity DataIC50: >3.00E+4nM. Assay description: Inhibition of PI5P4Kalpha (unknown origin) incubated for 1 hr by TR-FRET assay
In DepthDetails ArticlePubMed
TargetPhosphatidylinositol 5-phosphate 4-kinase type-2 beta(Homo sapiens (Human))
University Of Cambridge
Curated by ChEMBL
LigandPNGBDBM50497347(CHEMBL1529478)
Affinity DataIC50: <2.51E+4nM. Assay description: Inhibition of PI5P4Kbeta (unknown origin) by ADP-Glo assay
In DepthDetails ArticlePubMed