BDBM50498197 5-CHLOROINDOLE-2-CARBOXYLIC ACID
SMILES OC(=O)c1cc2cc(Cl)ccc2[nH]1
InChI Key InChIKey=FUQOTYRCMBZFOL-UHFFFAOYSA-N
Data  1 KI
PDB links: 1 PDB ID matches this monomer.
  Tab Delimited (TSV)   2D SDfile   Computed 3D by Vconf -m prep SDfile
Find this compound or compounds like it in BindingDB:
Activity Spreadsheet -- Enzyme Inhibition Constant Data from BindingDB
Found 1 hit for monomerid = 50498197
TargetCoagulation factor VII/Tissue factor(Homo sapiens (Human))
Bristol-Myers Squibb
Curated by ChEMBL
LigandPNGBDBM50498197(5-CHLOROINDOLE-2-CARBOXYLIC ACID)
Affinity DataKi:  3.50E+6nM. Assay description: Inhibition of human soluble tissue factor/factor VIIa expressed in Origami B (DE3) using D-Ile-Pro-Arg-pNA as substrate after 30 mins by spectrophoto...