BDBM50498812 CHEMBL3627855
SMILES COc1ccc(cc1)S(=O)(=O)N(CC(C)C)C[C@@H](O)[C@H](Cc1ccccc1)NC(=O)c1cccc(c1)C(=O)N1CCOCC1
InChI Key InChIKey=NTWNLXASNQVVHI-IOWSJCHKSA-N
Data  1 KI
  Tab Delimited (TSV)   2D SDfile   Computed 3D by Vconf -m prep SDfile
Find this compound or compounds like it in BindingDB:
Activity Spreadsheet -- Enzyme Inhibition Constant Data from BindingDB
Found 1 hit for monomerid = 50498812
TargetProtease(Human immunodeficiency virus 1 (HIV-1))
Purdue University
Curated by ChEMBL
LigandPNGBDBM50498812(CHEMBL3627855)
Affinity DataKi:  0.420nM. Assay description: Inhibition of HIV-1 protease by fluorometric assay
Ligand InfoPC cidPC sid
In DepthDetails ArticlePubMed