BDBM50499295 CHEMBL3735591
SMILES COc1cccc(c1)-c1ccc(NC(=O)[C@@H]2C[C@H]2c2nc(C)no2)c2cnccc12
InChI Key InChIKey=PHXHRVNVCWJKBD-RTBURBONSA-N
Data  2 IC50
  Tab Delimited (TSV)   2D SDfile   Computed 3D by Vconf -m prep SDfile
Find this compound or compounds like it in BindingDB:
Activity Spreadsheet -- Enzyme Inhibition Constant Data from BindingDB
Found 2 hits for monomerid = 50499295
LigandPNGBDBM50499295(CHEMBL3735591)
Affinity DataIC50:  2.28E+3nM. Assay description: Inhibition of MGAT2 (unknown origin) by CPM assay
Ligand InfoPC cidPC sid
In DepthDetails ArticlePubMed
TargetDiacylglycerol O-acyltransferase 2(Homo sapiens (Human))
Merck
Curated by ChEMBL
LigandPNGBDBM50499295(CHEMBL3735591)
Affinity DataIC50:  500nM. Assay description: Inhibition of human DGAT2 expressed in Sf9 cell membranes assessed as triolein formation by LC/MS/MS analysis using oleoyl-CoA as substrate
Ligand InfoPC cidPC sid
In DepthDetails ArticlePubMed