BDBM50499817 CHEMBL2441351
SMILES NC(=S)c1ccncc1
InChI Key InChIKey=KPIIGXWUNXGGCP-UHFFFAOYSA-N
Data  1 KI  1 IC50
  Tab Delimited (TSV)   2D SDfile   Computed 3D by Vconf -m prep SDfile
Find this compound or compounds like it in BindingDB:
Activity Spreadsheet -- Enzyme Inhibition Constant Data from BindingDB
Found 2 hits for monomerid = 50499817
TargetPolyphenol oxidase 2(Agaricus bisporus (Common mushroom))
Kyungpook National University
Curated by ChEMBL
LigandPNGBDBM50499817(CHEMBL2441351)
Affinity DataKi:  2.23E+4nM. Assay description: Non-competitive inhibition of mushroom tyrosinase using L-tyrosine as substrate by Lineweaver-Burk plots analysis
In DepthDetails ArticlePubMed
TargetPolyphenol oxidase 2(Agaricus bisporus (Common mushroom))
Kyungpook National University
Curated by ChEMBL
LigandPNGBDBM50499817(CHEMBL2441351)
Affinity DataIC50:  4.38E+4nM. Assay description: Inhibition of mushroom tyrosinase using L-tyrosine as substrate
In DepthDetails ArticlePubMed