BDBM50500906 CHEMBL3798263
SMILES Clc1ccc(CNc2ccnc(n2)N2CCC3(CCN(C3)C(=O)C3CCCN3)CC2)c(Cl)c1
InChI Key InChIKey=FCBVISPGBVZJDX-UHFFFAOYSA-N
Data  1 KI
  Tab Delimited (TSV)   2D SDfile   Computed 3D by Vconf -m prep SDfile
Find this compound or compounds like it in BindingDB:
Activity Spreadsheet -- Enzyme Inhibition Constant Data from BindingDB
Found 1 hit for monomerid = 50500906
TargetC-C chemokine receptor type 4(Homo sapiens (Human))
Glaxosmithkline Medicines Research Centre
Curated by ChEMBL
LigandPNGBDBM50500906(CHEMBL3798263)
Affinity DataKi:  25nM. Assay description: Displacement of [125I]-TARC from human recombinant CCR4 expressed in CHO cell membranes by scintillation counting method
Ligand InfoPC cidPC sid
In DepthDetails ArticlePubMed