BDBM50501254 CHEMBL3980253
SMILES O=S(=O)(Nc1ccc(cc1)-c1nc2cc(NS(=O)(=O)c3ccc4nsnc4c3)ccc2o1)c1ccc2nsnc2c1
InChI Key InChIKey=KNKNBKXGEGSPFV-UHFFFAOYSA-N
Data  8 IC50
  Tab Delimited (TSV)   2D SDfile   Computed 3D by Vconf -m prep SDfile
Find this compound or compounds like it in BindingDB:
Activity Spreadsheet -- Enzyme Inhibition Constant Data from BindingDB
Found 8 hits for monomerid = 50501254
Target60 kDa heat shock protein, mitochondrial(Homo sapiens)
Indiana University
Curated by ChEMBL
LigandPNGBDBM50501254(CHEMBL3980253)
Affinity DataIC50:  6.20E+4nM. Assay description: Inhibition of human mitochondrial HSP60/HSP10 expressed in Escherichia coli DH5alpha/BL21 (DE3) assessed as inhibition of denatured MDH refolding pre...
Ligand InfoPC cidPC sid
In DepthDetails ArticlePubMed
TargetCo-chaperonin GroES(Escherichia coli)
Indiana University
Curated by ChEMBL
LigandPNGBDBM50501254(CHEMBL3980253)
Affinity DataIC50:  1.70E+3nM. Assay description: Inhibition of Escherichia coli GroEL/GroES-ATPase activity expressed in Escherichia coli DH5alpha/BL21 (DE3) assessed as inhibition of denatured MDH ...
Ligand InfoPC cidPC sid
In DepthDetails ArticlePubMed
Target60 kDa heat shock protein, mitochondrial(Homo sapiens)
Indiana University
Curated by ChEMBL
LigandPNGBDBM50501254(CHEMBL3980253)
Affinity DataIC50:  1.27E+5nM. Assay description: Inhibition of human mitochondrial HSP60/HSP10-ATPase activity expressed in Escherichia coli DH5alpha/BL21 (DE3) assessed as inhibition of denatured M...
Ligand InfoPC cidPC sid
In DepthDetails ArticlePubMed
TargetTyrosine-protein phosphatase non-receptor type 5(Homo sapiens (Human))
Indiana University School Of Medicine
Curated by ChEMBL
LigandPNGBDBM50501254(CHEMBL3980253)
Affinity DataIC50:  1.10E+4nM. Assay description: Inhibition of human PTPN5 expressed in Escherichia coli Rosetta 2 (DE3) using pNPP as substrate after 45 mins by spectrophotometric method
Ligand InfoPC cidPC sid
In DepthDetails ArticlePubMed
TargetTyrosine-protein phosphatase non-receptor type 1(Homo sapiens (Human))
Indiana University School Of Medicine
Curated by ChEMBL
LigandPNGBDBM50501254(CHEMBL3980253)
Affinity DataIC50:  8.00E+3nM. Assay description: Inhibition of human PTPN1 expressed in Escherichia coli Rosetta 2 (DE3) using pNPP as substrate after 45 mins by spectrophotometric method
Ligand InfoPC cidPC sid
In DepthDetails ArticlePubMed
TargetTYR_PHOSPHATASE_2 domain-containing protein(Mycobacterium tuberculosis)
Indiana University School Of Medicine
Curated by ChEMBL
LigandPNGBDBM50501254(CHEMBL3980253)
Affinity DataIC50:  6.40E+3nM. Assay description: Inhibition of Mycobacterium tuberculosis His-tagged PtpB expressed in Escherichia coli Rosetta 2 (DE3) using pNPP as substrate after 30 mins by spect...
Ligand InfoPC cidPC sid
In DepthDetails ArticlePubMed
TargetTyrosine-protein phosphatase non-receptor type 2(Homo sapiens (Human))
Indiana University School Of Medicine
Curated by ChEMBL
LigandPNGBDBM50501254(CHEMBL3980253)
Affinity DataIC50:  1.10E+4nM. Assay description: Inhibition of human PTPN2 expressed in Escherichia coli Rosetta 2 (DE3) using pNPP as substrate after 45 mins by spectrophotometric method
Ligand InfoPC cidPC sid
In DepthDetails ArticlePubMed
TargetCo-chaperonin GroES(Escherichia coli)
Indiana University
Curated by ChEMBL
LigandPNGBDBM50501254(CHEMBL3980253)
Affinity DataIC50:  3.70E+3nM. Assay description: Inhibition of Escherichia coli GroEL/GroES expressed in Escherichia coli DH5alpha/BL21 (DE3) assessed as inhibition of denatured MDH refolding preinc...
Ligand InfoPC cidPC sid
In DepthDetails ArticlePubMed