BDBM50502792 CHEMBL4460034
SMILES NS(=O)(=O)c1cccc(c1)-c1nnc(o1)-c1ccc(Cl)cc1
InChI Key InChIKey=WSFBXXSBCRXLBR-UHFFFAOYSA-N
Data  4 KI  2 IC50
  Tab Delimited (TSV)   2D SDfile   Computed 3D by Vconf -m prep SDfile
Find this compound or compounds like it in BindingDB:
Activity Spreadsheet -- Enzyme Inhibition Constant Data from BindingDB
Found 6 hits for monomerid = 50502792
TargetCarbonic anhydrase 13(Homo sapiens (Human))
National Institute Of Pharmaceutical Education And Research (Niper)
Curated by ChEMBL
LigandPNGBDBM50502792(CHEMBL4460034)
Affinity DataKi:  16nM. Assay description: Inhibition of recombinant human carbonic anhydrase 13 by stopped flow CO2 hydrase assay
Ligand InfoPC cidPC sid
In DepthDetails ArticlePubMed
TargetCarbonic anhydrase 9(Homo sapiens (Human))
National Institute Of Pharmaceutical Education And Research (Niper)
Curated by ChEMBL
LigandPNGBDBM50502792(CHEMBL4460034)
Affinity DataKi:  55nM. Assay description: Inhibition of recombinant human carbonic anhydrase 9 by stopped flow CO2 hydrase assay
Ligand InfoPC cidPC sid
In DepthDetails ArticlePubMed
TargetCarbonic anhydrase 2(Homo sapiens (Human))
National Institute Of Pharmaceutical Education And Research (Niper)
Curated by ChEMBL
LigandPNGBDBM50502792(CHEMBL4460034)
Affinity DataKi:  608nM. Assay description: Inhibition of recombinant human carbonic anhydrase 2 by stopped flow CO2 hydrase assay
Ligand InfoPC cidPC sid
In DepthDetails ArticlePubMed
TargetCarbonic anhydrase 1(Homo sapiens (Human))
National Institute Of Pharmaceutical Education And Research (Niper)
Curated by ChEMBL
LigandPNGBDBM50502792(CHEMBL4460034)
Affinity DataKi:  916nM. Assay description: Inhibition of recombinant human carbonic anhydrase 1 by stopped flow CO2 hydrase assay
Ligand InfoPC cidPC sid
In DepthDetails ArticlePubMed
TargetAmine oxidase [flavin-containing] A(Homo sapiens (Human))
Ushinsky Yaroslavl State Pedagogical University
Curated by ChEMBL
LigandPNGBDBM50502792(CHEMBL4460034)
Affinity DataIC50: >1.00E+5nM. Assay description: Inhibition of human recombinant MAO-A expressed in insect cells microsomes assessed as inhibition of 4-hydroxyquinoline formation using kynuramine as...
Ligand InfoPC cidPC sid
In DepthDetails ArticlePubMed
TargetAmine oxidase [flavin-containing] B(Homo sapiens (Human))
Ushinsky Yaroslavl State Pedagogical University
Curated by ChEMBL
LigandPNGBDBM50502792(CHEMBL4460034)
Affinity DataIC50:  210nM. Assay description: Inhibition of human recombinant MAO-B expressed in insect cells microsomes assessed as inhibition of 4-hydroxyquinoline formation using kynuramine as...
Ligand InfoPC cidPC sid
In DepthDetails ArticlePubMed