BDBM50503132 CHEMBL4586628
SMILES CC(C)C(=O)CN1[C@@H](CCn2c1nc(cc2=O)N1CCOC[C@H]1C)C(F)(F)F
InChI Key InChIKey=ITCIAOUZMPREOO-OCCSQVGLSA-N
Data  7 IC50
PDB links: 1 PDB ID matches this monomer.
  Tab Delimited (TSV)   2D SDfile   Computed 3D by Vconf -m prep SDfile
Find this compound or compounds like it in BindingDB:
Activity Spreadsheet -- Enzyme Inhibition Constant Data from BindingDB
Found 7 hits for monomerid = 50503132
TargetPhosphatidylinositol 3-kinase catalytic subunit type 3(Homo sapiens (Human))
China Pharmaceutical University
Curated by ChEMBL
LigandPNGBDBM50503132(CHEMBL4586628)
Affinity DataIC50:  2nM. Assay description: Inhibition of Vps34 (unknown origin)
TargetPhosphatidylinositol 3-kinase catalytic subunit type 3(Homo sapiens (Human))
China Pharmaceutical University
Curated by ChEMBL
LigandPNGBDBM50503132(CHEMBL4586628)
Affinity DataIC50:  82nM. Assay description: Inhibition of Vps34 (unknown origin) by GFP-FYVE detection based cell based assay
TargetSerine/threonine-protein kinase mTOR(Homo sapiens (Human))
China Pharmaceutical University
Curated by ChEMBL
LigandPNGBDBM50503132(CHEMBL4586628)
Affinity DataIC50: >1.00E+4nM. Assay description: Inhibition of mTOR (unknown origin)
In DepthDetails ArticlePubMed
TargetPhosphatidylinositol 4,5-bisphosphate 3-kinase catalytic subunit alpha isoform(Homo sapiens (Human))
China Pharmaceutical University
Curated by ChEMBL
LigandPNGBDBM50503132(CHEMBL4586628)
Affinity DataIC50:  2.70E+3nM. Assay description: Inhibition of PI3K p110alpha (unknown origin)
In DepthDetails ArticlePubMed
TargetPhosphatidylinositol 4,5-bisphosphate 3-kinase catalytic subunit gamma isoform(Homo sapiens (Human))
China Pharmaceutical University
Curated by ChEMBL
LigandPNGBDBM50503132(CHEMBL4586628)
Affinity DataIC50:  2.50E+3nM. Assay description: Inhibition of PI3K p110gamma (unknown origin)
In DepthDetails ArticlePubMed
TargetPhosphatidylinositol 4,5-bisphosphate 3-kinase catalytic subunit delta isoform(Homo sapiens (Human))
China Pharmaceutical University
Curated by ChEMBL
LigandPNGBDBM50503132(CHEMBL4586628)
Affinity DataIC50: >1.00E+4nM. Assay description: Inhibition of PI3K p110delta (unknown origin)
In DepthDetails ArticlePubMed
TargetPhosphatidylinositol 4,5-bisphosphate 3-kinase catalytic subunit beta isoform(Homo sapiens (Human))
China Pharmaceutical University
Curated by ChEMBL
LigandPNGBDBM50503132(CHEMBL4586628)
Affinity DataIC50:  4.50E+3nM. Assay description: Inhibition of PI3K p110beta (unknown origin)
In DepthDetails ArticlePubMed