BDBM50503158 CHEMBL4589377
SMILES FC(F)(F)c1c(ccn2c(CC3CC3)nnc12)-c1ccc(CNC(=O)c2ccc(cc2)S(F)(=O)=O)cc1
InChI Key InChIKey=ALLKYFRFVNIHGD-UHFFFAOYSA-N
Data  2 KI  1 EC50
  Tab Delimited (TSV)   2D SDfile   Computed 3D by Vconf -m prep SDfile
Find this compound or compounds like it in BindingDB:
Activity Spreadsheet -- Enzyme Inhibition Constant Data from BindingDB
Found 3 hits for monomerid = 50503158
TargetMetabotropic glutamate receptor 2(Homo sapiens (Human))
Leiden University
Curated by ChEMBL
LigandPNGBDBM50503158(CHEMBL4589377)
Affinity DataKi:  4.20nM. Assay description: Displacement of [3H]JNJ-46281222 from human mGlu2 receptor expressed in CHOK1 cell membranes preincubated for 3 hrs followed by [3H]JNJ-46281222 addi...
Ligand InfoPC cidPC sid
In DepthDetails ArticlePubMed
TargetMetabotropic glutamate receptor 2(Homo sapiens (Human))
Leiden University
Curated by ChEMBL
LigandPNGBDBM50503158(CHEMBL4589377)
Affinity DataKi:  5.80nM. Assay description: Displacement of [3H]JNJ-46281222 from human mGlu2 receptor expressed in CHOK1 cell membranes after 1 hr by microbeta scintillation counting method
Ligand InfoPC cidPC sid
In DepthDetails ArticlePubMed
TargetMetabotropic glutamate receptor 2(Homo sapiens (Human))
Leiden University
Curated by ChEMBL
LigandPNGBDBM50503158(CHEMBL4589377)
Affinity DataEC50:  15nM. Assay description: Positive allosteric modulation of human mGlu2 receptor expressed in CHOK1 cell membranes assessed as increase in glutamate-induced [35S]GTPgammaS bin...
Ligand InfoPC cidPC sid
In DepthDetails ArticlePubMed