BDBM50503728 CHEMBL4531748
SMILES [H][C@]1(O[C@@H]2[C@@H](N)C[C@@H](N)[C@H](O)[C@H]2O)O[C@H](CNCc2ccccc2Cl)[C@@H](O)[C@H](O)[C@H]1N
InChI Key InChIKey=ZGCRPSVWSGGOON-ITRADPEYSA-N
Data  1 IC50
  Tab Delimited (TSV)   2D SDfile   Computed 3D by Vconf -m prep SDfile
Find this compound or compounds like it in BindingDB:
Activity Spreadsheet -- Enzyme Inhibition Constant Data from BindingDB
Found 1 hit for monomerid = 50503728
TargetProtein Rev(Human immunodeficiency virus 1)
The University Of Manchester
Curated by ChEMBL
LigandPNGBDBM50503728(CHEMBL4531748)
Affinity DataIC50:  7.00E+4nM. Assay description: Inhibition of [3H]Rev response element binding to HIV1 biotinylated-Rev protein expressed in Escherichia coli after 15 mins by scintillation proximit...
Ligand InfoPC cidPC sid
In DepthDetails ArticlePubMed