BDBM50503729 CHEMBL4460433
SMILES [H][C@]1(O[C@@H]2[C@@H](N)C[C@@H](N)[C@H](O)[C@H]2O)O[C@H](CNC\C=C\c2ccccc2)[C@@H](O)[C@H](O)[C@H]1N
InChI Key InChIKey=CAKMUVKRDJODMZ-MYYOWIPTSA-N
Data  1 IC50
  Tab Delimited (TSV)   2D SDfile   Computed 3D by Vconf -m prep SDfile
Find this compound or compounds like it in BindingDB:
Activity Spreadsheet -- Enzyme Inhibition Constant Data from BindingDB
Found 1 hit for monomerid = 50503729
TargetProtein Rev(Human immunodeficiency virus 1)
The University Of Manchester
Curated by ChEMBL
LigandPNGBDBM50503729(CHEMBL4460433)
Affinity DataIC50:  3.20E+4nM. Assay description: Inhibition of [3H]Rev response element binding to HIV1 biotinylated-Rev protein expressed in Escherichia coli after 15 mins by scintillation proximit...
Ligand InfoPC cidPC sid
In DepthDetails ArticlePubMed