BDBM50505284 CHEMBL4576324
SMILES CNC(=O)C[C@H]1CCCN(C1)C1CCN(CC[C@@H](\C(CN(C)C(=O)c2cc(Cl)cc(Cl)c2)=N\OC)c2ccc(Cl)c(Cl)c2)CC1
InChI Key InChIKey=GVVCESGMKYLPQX-SAYCYBPYSA-N
Data  3 KI
  Tab Delimited (TSV)   2D SDfile   Computed 3D by Vconf -m prep SDfile
Find this compound or compounds like it in BindingDB:
Activity Spreadsheet -- Enzyme Inhibition Constant Data from BindingDB
Found 3 hits for monomerid = 50505284
TargetNeuromedin-K receptor(Homo sapiens (Human))
China Pharmaceutical University
Curated by ChEMBL
LigandPNGBDBM50505284(CHEMBL4576324)
Affinity DataKi:  0.300nM. Assay description: Displacement of [125I][MePhe]NKB from human NK3 receptor expressed in CHO cells membranes
Ligand InfoPC cidPC sid
In DepthDetails ArticlePubMed
TargetSubstance-K receptor(Homo sapiens (Human))
China Pharmaceutical University
Curated by ChEMBL
LigandPNGBDBM50505284(CHEMBL4576324)
Affinity DataKi:  0.400nM. Assay description: Displacement of [3H]NKA from human NK2 receptor expressed in CHO cells membranes
Ligand InfoPC cidPC sid
In DepthDetails ArticlePubMed
TargetSubstance-P receptor(Homo sapiens (Human))
China Pharmaceutical University
Curated by ChEMBL
LigandPNGBDBM50505284(CHEMBL4576324)
Affinity DataKi:  1.30nM. Assay description: Displacement of [3H]Sar SP from human NK1 receptor expressed in CHO cells membranes
Ligand InfoPC cidPC sid
In DepthDetails ArticlePubMed