BDBM50505853 CHEMBL4539790
SMILES CC(=O)C1=C(N[B-]([O+]=C1N)(c1ccccc1)c1ccccc1)C(Cl)(Cl)Cl
InChI Key InChIKey=VKECODDKRKQJNM-UHFFFAOYSA-N
Data  1 IC50
  Tab Delimited (TSV)   2D SDfile   Computed 3D by Vconf -m prep SDfile
Find this compound or compounds like it in BindingDB:
Activity Spreadsheet -- Enzyme Inhibition Constant Data from BindingDB
Found 1 hit for monomerid = 50505853
TargetNACHT, LRR and PYD domains-containing protein 3(Homo sapiens (Human))
Shandong University
Curated by ChEMBL
LigandPNGBDBM50505853(CHEMBL4539790)
Affinity DataIC50:  74nM. Assay description: Inhibition of NLRP3 inflammasome activation in LPS-primed human THP1 cells assessed as reduction in IL-1beta level preincubated for 10 mins followed ...
In DepthDetails ArticlePubMed