BDBM50506047 CHEMBL4551475
SMILES Cc1c(nc(-c2ccc(Cl)o2)n1-c1c(Cl)ccc(N2CC(C2)c2nnn[nH]2)c1Cl)C(F)(F)F
InChI Key InChIKey=MBBLDVYCKXIIFG-UHFFFAOYSA-N
Data  1 IC50
  Tab Delimited (TSV)   2D SDfile   Computed 3D by Vconf -m prep SDfile
Find this compound or compounds like it in BindingDB:
Activity Spreadsheet -- Enzyme Inhibition Constant Data from BindingDB
Found 1 hit for monomerid = 50506047
TargetNuclear receptor ROR-gamma(Homo sapiens (Human))
Global Discovery Chemistry
Curated by ChEMBL
LigandPNGBDBM50506047(CHEMBL4551475)
Affinity DataIC50:  21nM. Assay description: Displacement of RIP140 cofactor peptide from human His6-tagged RORgammat LBD (264 to 518 residues) by TR-FRET assay
Ligand InfoPC cidPC sid
In DepthDetails ArticlePubMed