BDBM50506056 CHEMBL4554462
SMILES Cc1c(Cc2ccccc2)nc(-c2ccco2)n1-c1c(Cl)cccc1Cl
InChI Key InChIKey=YQPVLABIYDUDBN-UHFFFAOYSA-N
Data  3 IC50
PDB links: 1 PDB ID matches this monomer.
  Tab Delimited (TSV)   2D SDfile   Computed 3D by Vconf -m prep SDfile
Find this compound or compounds like it in BindingDB:
Activity Spreadsheet -- Enzyme Inhibition Constant Data from BindingDB
Found 3 hits for monomerid = 50506056
TargetNuclear receptor ROR-gamma(Homo sapiens (Human))
Global Discovery Chemistry
Curated by ChEMBL
LigandPNGBDBM50506056(CHEMBL4554462)
Affinity DataIC50:  5nM. Assay description: Displacement of RIP140 cofactor peptide from human His6-tagged RORgammat LBD (264 to 518 residues) by TR-FRET assay
Ligand InfoPC cidPC sidPDB
TargetNuclear receptor ROR-gamma(Homo sapiens (Human))
Global Discovery Chemistry
Curated by ChEMBL
LigandPNGBDBM50506056(CHEMBL4554462)
Affinity DataIC50:  84nM. Assay description: Inhibition of human full-length eGFP-tagged RORgammat expressed in human HUT78 T-cells assessed as inhibition of PMA/CD3 monoclonal antibody stimulat...
Ligand InfoPC cidPC sidPDB
TargetNuclear receptor ROR-gamma(Homo sapiens (Human))
Global Discovery Chemistry
Curated by ChEMBL
LigandPNGBDBM50506056(CHEMBL4554462)
Affinity DataIC50:  160nM. Assay description: Inverse agonist activity at RORgammat in human whole blood assessed as reduction in Con A/IL-23-stimulated IL-17 secretion after 72 hrs by ELISA
Ligand InfoPC cidPC sidPDB