BDBM50507831 CHEMBL4554983
SMILES NS(=O)(=O)c1ccc(cc1)C(=O)N1CCC(O)(CC1)c1ccc(Br)cc1
InChI Key InChIKey=ZQLLUFSMXSIJQC-UHFFFAOYSA-N
Data  6 KI
  Tab Delimited (TSV)   2D SDfile   Computed 3D by Vconf -m prep SDfile
Find this compound or compounds like it in BindingDB:
Activity Spreadsheet -- Enzyme Inhibition Constant Data from BindingDB
Found 6 hits for monomerid = 50507831
TargetCarbonic anhydrase 7(Homo sapiens (Human))
Universit£
Curated by ChEMBL
LigandPNGBDBM50507831(CHEMBL4554983)
Affinity DataKi:  0.550nM. Assay description: Inhibition of recombinant full length human carbonic anhydrase-7 assessed as reduction in CO2 hydration after 15 mins by phenol red dye based stopped...
Ligand InfoPC cidPC sid
In DepthDetails ArticlePubMed
TargetCarbonic anhydrase 2(Homo sapiens (Human))
Universit£
Curated by ChEMBL
LigandPNGBDBM50507831(CHEMBL4554983)
Affinity DataKi:  0.700nM. Assay description: Inhibition of recombinant full length human carbonic anhydrase-2 assessed as reduction in CO2 hydration after 15 mins by phenol red dye based stopped...
Ligand InfoPC cidPC sid
In DepthDetails ArticlePubMed
TargetCarbonic anhydrase 9(Homo sapiens (Human))
Universit£
Curated by ChEMBL
LigandPNGBDBM50507831(CHEMBL4554983)
Affinity DataKi:  4.70nM. Assay description: Inhibition of human carbonic anhydrase-9 catalytic domain assessed as reduction in CO2 hydration after 15 mins by phenol red dye based stopped flow a...
Ligand InfoPC cidPC sid
In DepthDetails ArticlePubMed
TargetCarbonic anhydrase 1(Homo sapiens (Human))
Universit£
Curated by ChEMBL
LigandPNGBDBM50507831(CHEMBL4554983)
Affinity DataKi:  6.30nM. Assay description: Inhibition of recombinant full length human carbonic anhydrase-1 assessed as reduction in CO2 hydration after 15 mins by phenol red dye based stopped...
Ligand InfoPC cidPC sid
In DepthDetails ArticlePubMed
TargetCarbonic anhydrase 14(Homo sapiens (Human))
Universit£
Curated by ChEMBL
LigandPNGBDBM50507831(CHEMBL4554983)
Affinity DataKi:  7.70nM. Assay description: Inhibition of human carbonic anhydrase-14 catalytic domain assessed as reduction in CO2 hydration after 15 mins by phenol red dye based stopped flow ...
Ligand InfoPC cidPC sid
In DepthDetails ArticlePubMed
TargetCarbonic anhydrase 12(Homo sapiens (Human))
Universit£
Curated by ChEMBL
LigandPNGBDBM50507831(CHEMBL4554983)
Affinity DataKi:  8.10nM. Assay description: Inhibition of human carbonic anhydrase-12 catalytic domain assessed as reduction in CO2 hydration after 15 mins by phenol red dye based stopped flow ...
Ligand InfoPC cidPC sid
In DepthDetails ArticlePubMed