BDBM50508029 CHEMBL4467856
SMILES CC(O[C@H]1CC[C@@]2(COC(C)(C)C2)CC1)c1nc(no1)-c1ccc(c(F)c1)S(C)(=O)=O
InChI Key InChIKey=FTMYHLQRBRBVKX-UOOZRTQDSA-N
Data  2 EC50
  Tab Delimited (TSV)   2D SDfile   Computed 3D by Vconf -m prep SDfile
Find this compound or compounds like it in BindingDB:
Activity Spreadsheet -- Enzyme Inhibition Constant Data from BindingDB
Found 2 hits for monomerid = 50508029
TargetGlucose-dependent insulinotropic receptor(Homo sapiens (Human))
Japan Tobacco
Curated by ChEMBL
LigandPNGBDBM50508029(CHEMBL4467856)
Affinity DataEC50:  89nM. Assay description: Agonist activity at recombinant human GPR119 expressed in HEK293 cells assessed as increase in intracellular cAMP accumulation measured after 30 mins
Ligand InfoPC cidPC sid
In DepthDetails ArticlePubMed
TargetGlucose-dependent insulinotropic receptor(Homo sapiens (Human))
Japan Tobacco
Curated by ChEMBL
LigandPNGBDBM50508029(CHEMBL4467856)
Affinity DataEC50:  89nM. Assay description: Agonist activity at human GPR119 expressed in HEK293 cells assessed as intracellular cAMP accumulation after 30 mins by HTRF assay
Ligand InfoPC cidPC sid
In DepthDetails ArticlePubMed