BDBM50509063 CHEMBL4515649
SMILES C[C@@H]1O[C@@H](OCc2cn(CCCCCC(=O)N(O)Cc3cn(CCCOc4c5Cc6cc(cc(Cc7cc(cc(Cc8cc(cc(Cc4cc(c5)C(C)(C)C)c8OCCCn4cc(CN(O)C(=O)CCCCCn5cc(CO[C@@H]8O[C@@H](C)[C@@H](O)[C@@H](O)[C@@H]8O)nn5)nn4)C(C)(C)C)c7OCCCn4cc(CN(O)C(=O)CCCCCn5cc(CO[C@@H]7O[C@@H](C)[C@@H](O)[C@@H](O)[C@@H]7O)nn5)nn4)C(C)(C)C)c6OCCCn4cc(CN(O)C(=O)CCCCCn5cc(CO[C@@H]6O[C@@H](C)[C@@H](O)[C@@H](O)[C@@H]6O)nn5)nn4)C(C)(C)C)nn3)nn2)[C@@H](O)[C@H](O)[C@@H]1O
InChI Key InChIKey=YURDQYHUBCHBPF-XBANDQJDSA-N
Data  4 IC50
  Tab Delimited (TSV)   2D SDfile   Computed 3D by Vconf -m prep SDfile
Find this compound or compounds like it in BindingDB:
Activity Spreadsheet -- Enzyme Inhibition Constant Data from BindingDB
Found 3 hits for monomerid = 50509063
TargetC-type lectin domain family 4 member M(Homo sapiens)
Universit£
Curated by ChEMBL
LigandPNGBDBM50509063(CHEMBL4515649)
Affinity DataIC50:  289nM. Assay description: Inhibition of DC-SIGN (unknown origin) expressed in human Jurkat cells assessed as inhibition of EBOV-pseudotyped virus infection measured after 48 h...
Ligand InfoKEGGPC cidPC sid
In DepthDetails ArticlePubMed
TargetC-type lectin domain family 4 member M(Homo sapiens)
Universit£
Curated by ChEMBL
LigandPNGBDBM50509063(CHEMBL4515649)
Affinity DataIC50:  188nM. Assay description: Inhibition of full-length DC-SIGN (unknown origin) expressed in human monocyte derived dendritic cells assessed as inhibition of binding to recombina...
Ligand InfoKEGGPC cidPC sid
In DepthDetails ArticlePubMed
TargetC-type lectin domain family 4 member M(Homo sapiens)
Universit£
Curated by ChEMBL
LigandPNGBDBM50509063(CHEMBL4515649)
Affinity DataIC50:  2.68E+4nM. Assay description: Inhibition of DC-SIGN extracellular domain (unknown origin) binding to HIV gp120 by surface plasmon resonance analysis
Ligand InfoKEGGPC cidPC sid
In DepthDetails ArticlePubMed