BDBM50509113 CHEMBL4465196
SMILES Clc1ccc(cc1)N1C(=O)\C(=N/Nc2cn[nH]c(=O)c2Cl)c2ccccc12
InChI Key InChIKey=UOBRGWFCXFAWJC-KQWNVCNZSA-N
Data  1 IC50
  Tab Delimited (TSV)   2D SDfile   Computed 3D by Vconf -m prep SDfile
Find this compound or compounds like it in BindingDB:
Activity Spreadsheet -- Enzyme Inhibition Constant Data from BindingDB
Found 1 hit for monomerid = 50509113
TargetDNA ligase 1(Homo sapiens (Human))
University Of Allahabad
Curated by ChEMBL
LigandPNGBDBM50509113(CHEMBL4465196)
Affinity DataIC50:  2.65E+4nM. Assay description: Inhibition of human DNA ligase 1 expressed in Escherichia coli BL21 (DE3) cells using nicked DNA as substrate preincubated for 30 mins followed by su...
Ligand InfoPC cidPC sid
In DepthDetails ArticlePubMed