BDBM50509115 CHEMBL4556388
SMILES Clc1ccc2NC(=O)\C(=N/Nc3cn[nH]c(=O)c3Cl)c2c1
InChI Key InChIKey=IDFZEXIYLUWNJB-UHFFFAOYSA-N
Data  1 IC50
  Tab Delimited (TSV)   2D SDfile   Computed 3D by Vconf -m prep SDfile
Find this compound or compounds like it in BindingDB:
Activity Spreadsheet -- Enzyme Inhibition Constant Data from BindingDB
Found 1 hit for monomerid = 50509115
TargetDNA ligase 1(Homo sapiens (Human))
University Of Allahabad
Curated by ChEMBL
LigandPNGBDBM50509115(CHEMBL4556388)
Affinity DataIC50:  1.41E+4nM. Assay description: Inhibition of human DNA ligase 1 expressed in Escherichia coli BL21 (DE3) cells using nicked DNA as substrate preincubated for 30 mins followed by su...
Ligand InfoPC cidPC sid
In DepthDetails ArticlePubMed