BDBM50509331 CHEMBL4527625
SMILES [H][C@@]12COc3cc(ccc3[C@@]1(CCN2C(=O)[C@H]1CC[C@@H](CC1)C(O)=O)S(=O)(=O)c1ccc(F)cc1)C(F)(C(F)(F)F)C(F)(F)F
InChI Key InChIKey=USEIONJENDBBQE-KBLCWGLDSA-N
Data  5 IC50  2 EC50
  Tab Delimited (TSV)   2D SDfile   Computed 3D by Vconf -m prep SDfile
Find this compound or compounds like it in BindingDB:
Activity Spreadsheet -- Enzyme Inhibition Constant Data from BindingDB
Found 7 hits for monomerid = 50509331
TargetNuclear receptor subfamily 1 group I member 2(Homo sapiens (Human))
Bristol-Myers Squibb
Curated by ChEMBL
LigandPNGBDBM50509331(CHEMBL4527625)
Affinity DataIC50: >4.00E+4nM. Assay description: Activity at PXR (unknown origin)
Ligand InfoPC cidPC sid
In DepthDetails ArticlePubMed
TargetNuclear receptor ROR-gamma(Homo sapiens (Human))
Bristol-Myers Squibb
Curated by ChEMBL
LigandPNGBDBM50509331(CHEMBL4527625)
Affinity DataEC50:  16nM. Assay description: Inverse agonist activity at full length human RORgammat expressed in human Jurkat cells assessed as inhibition of constitutive receptor activity incu...
Ligand InfoPC cidPC sid
In DepthDetails ArticlePubMed
TargetOxysterols receptor LXR-beta(Homo sapiens (Human))
Bristol-Myers Squibb
Curated by ChEMBL
LigandPNGBDBM50509331(CHEMBL4527625)
Affinity DataIC50: >1.00E+4nM. Assay description: Activity at LXRbeta (unknown origin)
Ligand InfoPC cidPC sid
In DepthDetails ArticlePubMed
TargetOxysterols receptor LXR-alpha(Homo sapiens (Human))
Bristol-Myers Squibb
Curated by ChEMBL
LigandPNGBDBM50509331(CHEMBL4527625)
Affinity DataIC50: >1.00E+4nM. Assay description: Activity at LXRalpha (unknown origin)
Ligand InfoPC cidPC sid
In DepthDetails ArticlePubMed
TargetNuclear receptor ROR-alpha(Homo sapiens (Human))
Bristol-Myers Squibb
Curated by ChEMBL
LigandPNGBDBM50509331(CHEMBL4527625)
Affinity DataIC50: >1.00E+4nM. Assay description: Activity at RORalpha (unknown origin)
Ligand InfoPC cidPC sid
In DepthDetails ArticlePubMed
TargetNuclear receptor ROR-beta(Homo sapiens (Human))
Bristol-Myers Squibb
Curated by ChEMBL
LigandPNGBDBM50509331(CHEMBL4527625)
Affinity DataIC50: >1.00E+4nM. Assay description: Activity at RORbeta (unknown origin)
Ligand InfoPC cidPC sid
In DepthDetails ArticlePubMed
TargetNuclear receptor ROR-gamma(Homo sapiens (Human))
Bristol-Myers Squibb
Curated by ChEMBL
LigandPNGBDBM50509331(CHEMBL4527625)
Affinity DataEC50:  54nM. Assay description: Inverse agonist activity at RORgammat in CD3 and CD28-stimulated human whole blood assessed as reduction in IL17A production incubated for 1 hr befor...
Ligand InfoPC cidPC sid
In DepthDetails ArticlePubMed