BDBM50510050 CHEMBL4463485
SMILES Cc1nn(c(C)c1-c1cccc(F)c1)-c1ccc2NCCc2c1
InChI Key InChIKey=HOCYHFPGIJMZBD-UHFFFAOYSA-N
Data  3 IC50
  Tab Delimited (TSV)   2D SDfile   Computed 3D by Vconf -m prep SDfile
Find this compound or compounds like it in BindingDB:
Activity Spreadsheet -- Enzyme Inhibition Constant Data from BindingDB
Found 3 hits for monomerid = 50510050
TargetAcid-sensing ion channel 2(Mus musculus)
Promidis
Curated by ChEMBL
LigandPNGBDBM50510050(CHEMBL4463485)
Affinity DataIC50: >3.00E+4nM. Assay description: Inhibition of pH 5.5-stimulated mouse ASIC2a homomer expressed in CHOK1 cells assessed as reduction in channel activation by VSD fluorescence assay
Ligand InfoPC cidPC sid
In DepthDetails ArticlePubMed
TargetAcid-sensing ion channel 1(Mus musculus)
Promidis
Curated by ChEMBL
LigandPNGBDBM50510050(CHEMBL4463485)
Affinity DataIC50: >3.00E+4nM. Assay description: Inhibition of pH 6.6-stimulated mouse ASIC1a homomer expressed in CHOK1 cells assessed as reduction in channel activation by VSD fluorescence assay
Ligand InfoPC cidPC sid
In DepthDetails ArticlePubMed
TargetAcid-sensing ion channel 2(Mus musculus)
Promidis
Curated by ChEMBL
LigandPNGBDBM50510050(CHEMBL4463485)
Affinity DataIC50: >3.00E+4nM. Assay description: Inhibition of pH 6.25-stimulated mouse ASIC1a/2a heterodimer expressed in CHOK1 cells assessed as reduction in channel activation by VSD fluorescence...
Ligand InfoPC cidPC sid
In DepthDetails ArticlePubMed