BDBM50510356 CHEMBL4584135
SMILES COc1nc2ccc(cc2c(Cl)c1CN1CCC(CC1)C(F)(F)F)C(O)(C1CCOCC1)c1cnc(C)n1C
InChI Key InChIKey=CFBTYAWRRUTEAZ-UHFFFAOYSA-N
Data  1 IC50  1 Kd
  Tab Delimited (TSV)   2D SDfile   Computed 3D by Vconf -m prep SDfile
Find this compound or compounds like it in BindingDB:
Activity Spreadsheet -- Enzyme Inhibition Constant Data from BindingDB
Found 2 hits for monomerid = 50510356
TargetNuclear receptor ROR-gamma(Homo sapiens (Human))
Janssen Research And Development
Curated by ChEMBL
LigandPNGBDBM50510356(CHEMBL4584135)
Affinity DataIC50:  25nM. Assay description: Inverse agonist activity at GAL4-DNA binding domain-fused human full length RORgammat LBD expressed in pGL4.31 transfected HEK293T cells assessed as ...
Ligand InfoPC cidPC sid
In DepthDetails ArticlePubMed
TargetNuclear receptor ROR-gamma(Homo sapiens (Human))
Janssen Research And Development
Curated by ChEMBL
LigandPNGBDBM50510356(CHEMBL4584135)
Affinity DataKd:  0.600nM. Assay description: Displacement of thermofluor from human recombinant N-terminal TEV cleavage site-fused-His-tagged RORgammat LBD expressed in Escherichia coli assessed...
Ligand InfoPC cidPC sid
In DepthDetails ArticlePubMed