BDBM50510379 CHEMBL4452969
SMILES Cc1ccc(Nc2ncnc3sc4CN(CCc4c23)S(=O)(=O)c2ccc(F)cc2F)c(Br)c1
InChI Key InChIKey=VYDDTNRJDAAQTG-UHFFFAOYSA-N
Data  1 IC50
  Tab Delimited (TSV)   2D SDfile   Computed 3D by Vconf -m prep SDfile
Find this compound or compounds like it in BindingDB:
Activity Spreadsheet -- Enzyme Inhibition Constant Data from BindingDB
Found 1 hit for monomerid = 50510379
TargetMAP kinase-interacting serine/threonine-protein kinase 1(Homo sapiens (Human))
Chengdu Medical College
Curated by ChEMBL
LigandPNGBDBM50510379(CHEMBL4452969)
Affinity DataIC50:  1.68E+3nM. Assay description: Inhibition of human MNK1 using CREBtide substrate by gamma-[32P]-ATP competitive inhibition assay
Ligand InfoPC cidPC sid
In DepthDetails ArticlePubMed