BDBM50510407 CHEMBL4472464
SMILES Fc1ccc(Nc2ncnc3sc4CN(Cc5ccccc5)CCc4c23)c(Br)c1
InChI Key InChIKey=NFORFRGHZBCQCB-UHFFFAOYSA-N
Data  1 IC50
  Tab Delimited (TSV)   2D SDfile   Computed 3D by Vconf -m prep SDfile
Find this compound or compounds like it in BindingDB:
Activity Spreadsheet -- Enzyme Inhibition Constant Data from BindingDB
Found 1 hit for monomerid = 50510407
TargetMAP kinase-interacting serine/threonine-protein kinase 1(Homo sapiens (Human))
Chengdu Medical College
Curated by ChEMBL
LigandPNGBDBM50510407(CHEMBL4472464)
Affinity DataIC50:  1.12E+3nM. Assay description: Inhibition of human MNK1 using CREBtide substrate by gamma-[32P]-ATP competitive inhibition assay
Ligand InfoPC cidPC sid
In DepthDetails ArticlePubMed