BDBM50510410 CHEMBL4450446
SMILES COc1cc(F)ccc1Nc1ncnc2sc3CN(CCc3c12)S(=O)(=O)c1ccc(F)cc1F
InChI Key InChIKey=ZSCVKLZMVFBILS-UHFFFAOYSA-N
Data  1 IC50
  Tab Delimited (TSV)   2D SDfile   Computed 3D by Vconf -m prep SDfile
Find this compound or compounds like it in BindingDB:
Activity Spreadsheet -- Enzyme Inhibition Constant Data from BindingDB
Found 1 hit for monomerid = 50510410
TargetMAP kinase-interacting serine/threonine-protein kinase 1(Homo sapiens (Human))
Chengdu Medical College
Curated by ChEMBL
LigandPNGBDBM50510410(CHEMBL4450446)
Affinity DataIC50:  930nM. Assay description: Inhibition of human MNK1 using CREBtide substrate by gamma-[32P]-ATP competitive inhibition assay
Ligand InfoPC cidPC sid
In DepthDetails ArticlePubMed