BDBM50510433 CHEMBL4584574
SMILES Fc1ccc(Nc2ncnc3sc4CN(CCc4c23)S(=O)(=O)c2cccs2)c(F)c1
InChI Key InChIKey=WGIBPDIKGXNPIG-UHFFFAOYSA-N
Data  1 IC50
  Tab Delimited (TSV)   2D SDfile   Computed 3D by Vconf -m prep SDfile
Find this compound or compounds like it in BindingDB:
Activity Spreadsheet -- Enzyme Inhibition Constant Data from BindingDB
Found 1 hit for monomerid = 50510433
TargetMAP kinase-interacting serine/threonine-protein kinase 1(Homo sapiens (Human))
Chengdu Medical College
Curated by ChEMBL
LigandPNGBDBM50510433(CHEMBL4584574)
Affinity DataIC50:  1.46E+3nM. Assay description: Inhibition of human MNK1 using CREBtide substrate by gamma-[32P]-ATP competitive inhibition assay
Ligand InfoPC cidPC sid
In DepthDetails ArticlePubMed