BDBM50510493 CHEMBL4476161
SMILES CC(C)C(=O)N1CCC(C[C@H](N2CC(=O)N(CC2=O)c2ccc(Oc3ccccc3)cc2)c2nc3ccc(C)cc3n2C)CC1
InChI Key InChIKey=PYNSRWPXURAEMH-YTTGMZPUSA-N
Data  2 IC50
  Tab Delimited (TSV)   2D SDfile   Computed 3D by Vconf -m prep SDfile
Find this compound or compounds like it in BindingDB:
Activity Spreadsheet -- Enzyme Inhibition Constant Data from BindingDB
Found 2 hits for monomerid = 50510493
TargetBile acid receptor(Homo sapiens (Human))
Hiroshima International University
Curated by ChEMBL
LigandPNGBDBM50510493(CHEMBL4476161)
Affinity DataIC50:  1.50E+4nM. Assay description: Antagonist activity at GST-tagged FXR LBD (unknown origin) assessed as inhibition of GW4064-induced fluorecein-labeled SRC2-2 coactivator recruitment...
Ligand InfoPC cidPC sid
In DepthDetails ArticlePubMed
TargetBile acid receptor(Homo sapiens (Human))
Hiroshima International University
Curated by ChEMBL
LigandPNGBDBM50510493(CHEMBL4476161)
Affinity DataIC50:  859nM. Assay description: Antagonist activity at human FXR expressed in Huh7 cells assessed as inhibition of CDCA-induced FXR response element driven luciferase activity after...
Ligand InfoPC cidPC sid
In DepthDetails ArticlePubMed