BDBM50510969 CHEMBL4582321
SMILES CCOc1ccccc1N1CCN(CCCCC(=O)NCc2nc3cc(F)ccc3c(=O)n2-c2ccccc2)CC1
InChI Key InChIKey=GETYZZFUWBQSDU-UHFFFAOYSA-N
Data  2 IC50
  Tab Delimited (TSV)   2D SDfile   Computed 3D by Vconf -m prep SDfile
Find this compound or compounds like it in BindingDB:
Activity Spreadsheet -- Enzyme Inhibition Constant Data from BindingDB
Found 2 hits for monomerid = 50510969
Target5-hydroxytryptamine receptor 7(Homo sapiens (Human))
Normandie Univ
Curated by ChEMBL
LigandPNGBDBM50510969(CHEMBL4582321)
Affinity DataIC50:  12nM. Assay description: Antagonist activity at 5-HT7 receptor (unknown origin)
Ligand InfoPC cidPC sid
In DepthDetails ArticlePubMed
Target5-hydroxytryptamine receptor 1A(Homo sapiens (Human))
Normandie Univ
Curated by ChEMBL
LigandPNGBDBM50510969(CHEMBL4582321)
Affinity DataIC50:  500nM. Assay description: Antagonist activity at 5-HT1A receptor (unknown origin)
Ligand InfoPC cidPC sid
In DepthDetails ArticlePubMed