BDBM50511000 3-Hydroxymyristic Acid::CHEBI:42539::CHEMBL1232858
SMILES CCCCCCCCCCC[C@@H](O)CC(O)=O
InChI Key InChIKey=ATRNZOYKSNPPBF-CYBMUJFWSA-N
Data  1 KI  2 EC50
PDB links: 19 PDB IDs match this monomer.
  Tab Delimited (TSV)   2D SDfile   Computed 3D by Vconf -m prep SDfile
Find this compound or compounds like it in BindingDB:
Activity Spreadsheet -- Enzyme Inhibition Constant Data from BindingDB
Found 2 hits for monomerid = 50511000
TargetG-protein coupled receptor 84(Homo sapiens (Human))
University Of Bonn
Curated by ChEMBL
LigandPNGBDBM50511000(3-Hydroxymyristic Acid | CHEBI:42539 | CHEMBL12328...)
Affinity DataEC50:  1.75E+3nM. Assay description: Agonist activity at recombinant human GPR84 expressed in CHO cell membranes co-expressing beta-arrestin2 assessed as inhibition of forskolin-stimulat...
In DepthDetails ArticlePubMed
TargetG-protein coupled receptor 84(Homo sapiens (Human))
University Of Bonn
Curated by ChEMBL
LigandPNGBDBM50511000(3-Hydroxymyristic Acid | CHEBI:42539 | CHEMBL12328...)
Affinity DataEC50:  452nM. Assay description: Agonist activity at recombinant human GPR84 expressed in CHO cell membranes co-expressing beta-arrestin2 assessed as beta-arrestin 2 recruitment meas...
In DepthDetails ArticlePubMed