BDBM50511001 CHEMBL4439640
SMILES Cc1ccc(CCNc2cc(=O)[nH]c(=O)[nH]2)cc1
InChI Key InChIKey=YVEDOLINFOSTJV-UHFFFAOYSA-N
Data  1 KI
  Tab Delimited (TSV)   2D SDfile   Computed 3D by Vconf -m prep SDfile
Find this compound or compounds like it in BindingDB:
Activity Spreadsheet -- Enzyme Inhibition Constant Data from BindingDB
Found 1 hit for monomerid = 50511001
TargetG-protein coupled receptor 84(Homo sapiens (Human))
University Of Bonn
Curated by ChEMBL
LigandPNGBDBM50511001(CHEMBL4439640)
Affinity DataKi:  1.30nM. Assay description: Displacement of [3H]PSB-1584 from recombinant human GPR84 expressed in CHO cell membranes co-expressing beta-arrestin2 measured after 6 hrs by scinti...
Ligand InfoPC cidPC sid
In DepthDetails ArticlePubMed