BDBM50511002 CHEMBL4288936
SMILES CCCCCCCCCC(O)CC(O)=O
InChI Key InChIKey=MUCMKTPAZLSKTL-UHFFFAOYSA-N
Data  1 KI  3 EC50
PDB links: 3 PDB IDs match this monomer.
  Tab Delimited (TSV)   2D SDfile   Computed 3D by Vconf -m prep SDfile
Find this compound or compounds like it in BindingDB:
Activity Spreadsheet -- Enzyme Inhibition Constant Data from BindingDB
Found 4 hits for monomerid = 50511002
TargetG-protein coupled receptor 84(Homo sapiens (Human))
University Of Bonn
Curated by ChEMBL
LigandPNGBDBM50511002(CHEMBL4288936)
Affinity DataKi:  110nM. Assay description: Displacement of [3H]PSB-1584 from recombinant human GPR84 expressed in CHO cell membranes co-expressing beta-arrestin2 measured after 6 hrs by scinti...
TargetG-protein coupled receptor 84(Homo sapiens (Human))
University Of Bonn
Curated by ChEMBL
LigandPNGBDBM50511002(CHEMBL4288936)
Affinity DataEC50:  1.30E+4nM. Assay description: Agonist activity at human Gialpha-coupled GPR84 expressed in baculovirus infected sf9 insect cells assessed as induction of [35S]GTPgammaS incubated ...
TargetG-protein coupled receptor 84(Homo sapiens (Human))
University Of Bonn
Curated by ChEMBL
LigandPNGBDBM50511002(CHEMBL4288936)
Affinity DataEC50:  1.31E+3nM. Assay description: Agonist activity at recombinant human GPR84 expressed in CHO cell membranes co-expressing beta-arrestin2 assessed as inhibition of forskolin-stimulat...
TargetG-protein coupled receptor 84(Homo sapiens (Human))
University Of Bonn
Curated by ChEMBL
LigandPNGBDBM50511002(CHEMBL4288936)
Affinity DataEC50:  3.25E+3nM. Assay description: Agonist activity at recombinant human GPR84 expressed in CHO cell membranes co-expressing beta-arrestin2 assessed as beta-arrestin 2 recruitment meas...