BDBM50511419 CHEMBL4517979
SMILES CN(C)C\C=C\C(=O)NC1CCC(CC1)C(=O)Nc1cccc(Nc2cc(ncn2)-c2cnc3[nH]ccc3c2)c1
InChI Key InChIKey=TWNLBUPLPGVPQC-QPJJXVBHSA-N
Data  2 IC50
  Tab Delimited (TSV)   2D SDfile   Computed 3D by Vconf -m prep SDfile
Find this compound or compounds like it in BindingDB:
Activity Spreadsheet -- Enzyme Inhibition Constant Data from BindingDB
Found 2 hits for monomerid = 50511419
TargetPhosphatidylinositol 5-phosphate 4-kinase type-2 beta(Homo sapiens (Human))
Dana-Farber Cancer Institute
Curated by ChEMBL
LigandPNGBDBM50511419(CHEMBL4517979)
Affinity DataIC50:  3.18E+4nM. Assay description: Inhibition of PI5P4Kbeta (unknown origin) incubated for 15 mins in presence of ATP by ADP-Glo assay
Ligand InfoPC cidPC sid
In DepthDetails ArticlePubMed
TargetPhosphatidylinositol 5-phosphate 4-kinase type-2 alpha(Homo sapiens)
Dana-Farber Cancer Institute
Curated by ChEMBL
LigandPNGBDBM50511419(CHEMBL4517979)
Affinity DataIC50:  2.00E+3nM. Assay description: Inhibition of PI5P4Kalpha (unknown origin) incubated for 15 mins in presence of ATP by ADP-Glo assay
Ligand InfoPC cidPC sid
In DepthDetails ArticlePubMed