BDBM50512951 Avibactam sodium::CHEBI:85982::Nxl-104
SMILES [Na;v0+].[#7]-[#6](=O)-[#6@@H]-1-[#6]-[#6]-[#6@@H]-2-[#6]-[#7]-1-[#6](=O)-[#7]-2-[#8]S([#8-])(=O)=O
InChI Key InChIKey=RTCIKUMODPANKX-JBUOLDKXSA-M
Data  1 IC50
  Tab Delimited (TSV)   2D SDfile   Computed 3D by Vconf -m prep SDfile
Find this compound or compounds like it in BindingDB:
Activity Spreadsheet -- Enzyme Inhibition Constant Data from BindingDB
Found 1 hit for monomerid = 50512951
TargetPeptidoglycan D,D-transpeptidase MrdA(Escherichia coli)
Mutabilis
Curated by ChEMBL
LigandPNGBDBM50512951(Avibactam sodium | CHEBI:85982 | Nxl-104)
Affinity DataIC50:  590nM. Assay description: Inhibition of bocillin-FL binding to Escherichia coli K12 NusA-fused/His6-tagged PBP2 (57 to 615 residues) expressed in Escherichia coli BL21(DE3) pr...
In DepthDetails ArticlePubMed