BDBM50513295 CHEMBL4592146
SMILES CC1CCCC2(C1)NC(=O)N(CC(=O)NCc1ccc(cc1)S(N)(=O)=O)C2=O
InChI Key InChIKey=RHOCPQDYVNIVHE-UHFFFAOYSA-N
Data  11 KI
  Tab Delimited (TSV)   2D SDfile   Computed 3D by Vconf -m prep SDfile
Find this compound or compounds like it in BindingDB:
Activity Spreadsheet -- Enzyme Inhibition Constant Data from BindingDB
Found 11 hits for monomerid = 50513295
TargetCarbonic anhydrase 7(Homo sapiens (Human))
University Of Florence
Curated by ChEMBL
LigandPNGBDBM50513295(CHEMBL4592146)
Affinity DataKi:  4.40nM. Assay description: Inhibition of human carbonic anhydrase 7 incubated for 15 mins prior to testing by stopped-flow CO2 hydration assay
Ligand InfoPC cidPC sid
In DepthDetails ArticlePubMed
TargetCarbonic anhydrase 2(Homo sapiens (Human))
University Of Florence
Curated by ChEMBL
LigandPNGBDBM50513295(CHEMBL4592146)
Affinity DataKi:  8.30nM. Assay description: Inhibition of human carbonic anhydrase 2 incubated for 15 mins prior to testing by stopped-flow CO2 hydration assay
Ligand InfoPC cidPC sid
In DepthDetails ArticlePubMed
TargetCarbonic anhydrase 12(Homo sapiens (Human))
University Of Florence
Curated by ChEMBL
LigandPNGBDBM50513295(CHEMBL4592146)
Affinity DataKi:  33nM. Assay description: Inhibition of human carbonic anhydrase 12 incubated for 15 mins prior to testing by stopped-flow CO2 hydration assay
Ligand InfoPC cidPC sid
In DepthDetails ArticlePubMed
TargetCarbonic anhydrase 9(Homo sapiens (Human))
University Of Florence
Curated by ChEMBL
LigandPNGBDBM50513295(CHEMBL4592146)
Affinity DataKi:  229nM. Assay description: Inhibition of human carbonic anhydrase 9 incubated for 15 mins prior to testing by stopped-flow CO2 hydration assay
Ligand InfoPC cidPC sid
In DepthDetails ArticlePubMed
TargetCarbonic anhydrase 1(Homo sapiens (Human))
University Of Florence
Curated by ChEMBL
LigandPNGBDBM50513295(CHEMBL4592146)
Affinity DataKi:  853nM. Assay description: Inhibition of human carbonic anhydrase 1 incubated for 15 mins prior to testing by stopped-flow CO2 hydration assay
Ligand InfoPC cidPC sid
In DepthDetails ArticlePubMed
TargetCarbonic anhydrase 5A, mitochondrial(Homo sapiens (Human))
University Of Florence
Curated by ChEMBL
LigandPNGBDBM50513295(CHEMBL4592146)
Affinity DataKi:  4.47E+3nM. Assay description: Inhibition of human carbonic anhydrase 5A incubated for 15 mins prior to testing by stopped-flow CO2 hydration assay
Ligand InfoPC cidPC sid
In DepthDetails ArticlePubMed
TargetCarbonic anhydrase 4(Homo sapiens (Human))
University Of Florence
Curated by ChEMBL
LigandPNGBDBM50513295(CHEMBL4592146)
Affinity DataKi:  6.39E+3nM. Assay description: Inhibition of human carbonic anhydrase 4 incubated for 15 mins prior to testing by stopped-flow CO2 hydration assay
Ligand InfoPC cidPC sid
In DepthDetails ArticlePubMed
TargetCarbonic anhydrase 5B, mitochondrial(Homo sapiens (Human))
University Of Florence
Curated by ChEMBL
LigandPNGBDBM50513295(CHEMBL4592146)
Affinity DataKi:  8.57E+3nM. Assay description: Inhibition of human carbonic anhydrase 5B incubated for 15 mins prior to testing by stopped-flow CO2 hydration assay
Ligand InfoPC cidPC sid
In DepthDetails ArticlePubMed
TargetCarbonic anhydrase 3(Homo sapiens (Human))
University Of Florence
Curated by ChEMBL
LigandPNGBDBM50513295(CHEMBL4592146)
Affinity DataKi: >1.00E+4nM. Assay description: Inhibition of human carbonic anhydrase 3 incubated for 15 mins prior to testing by stopped-flow CO2 hydration assay
Ligand InfoPC cidPC sid
In DepthDetails ArticlePubMed
TargetCarbonic anhydrase 6(Homo sapiens (Human))
University Of Florence
Curated by ChEMBL
LigandPNGBDBM50513295(CHEMBL4592146)
Affinity DataKi: >1.00E+4nM. Assay description: Inhibition of human carbonic anhydrase 6 incubated for 15 mins prior to testing by stopped-flow CO2 hydration assay
Ligand InfoPC cidPC sid
In DepthDetails ArticlePubMed
TargetCarbonic anhydrase 13(Homo sapiens (Human))
University Of Florence
Curated by ChEMBL
LigandPNGBDBM50513295(CHEMBL4592146)
Affinity DataKi: >1.00E+4nM. Assay description: Inhibition of human carbonic anhydrase 13 incubated for 15 mins prior to testing by stopped-flow CO2 hydration assay
Ligand InfoPC cidPC sid
In DepthDetails ArticlePubMed