BDBM50513415 CHEMBL4435010
SMILES Cl.COc1ccc2n(cc(-c3cnc(N)[nH]3)c2c1)S(=O)(=O)c1ccccc1
InChI Key InChIKey=GJDXAYDBLVQEKU-UHFFFAOYSA-N
Data  5 KI
  Tab Delimited (TSV)   2D SDfile   Computed 3D by Vconf -m prep SDfile
Find this compound or compounds like it in BindingDB:
Activity Spreadsheet -- Enzyme Inhibition Constant Data from BindingDB
Found 5 hits for monomerid = 50513415
Target5-hydroxytryptamine receptor 6(Homo sapiens (Human))
Polish Academy Of Sciences
Curated by ChEMBL
LigandPNGBDBM50513415(CHEMBL4435010)
Affinity DataKi:  2nM. Assay description: Displacement of [3H]LSD from human 5HT6 receptor expressed in HEK293 cells measured after 1 hr by liquid scintillation counter method
Ligand InfoPC cidPC sid
In DepthDetails ArticlePubMed
Target5-hydroxytryptamine receptor 2A(Homo sapiens (Human))
Polish Academy Of Sciences
Curated by ChEMBL
LigandPNGBDBM50513415(CHEMBL4435010)
Affinity DataKi:  794nM. Assay description: Displacement of [3H]ketanserin from human 5HT2A receptor expressed in CHOK1 cells incubated for 1 hr by liquid scintillation counter method
Ligand InfoPC cidPC sid
In DepthDetails ArticlePubMed
Target5-hydroxytryptamine receptor 7(Homo sapiens (Human))
Polish Academy Of Sciences
Curated by ChEMBL
LigandPNGBDBM50513415(CHEMBL4435010)
Affinity DataKi:  1.15E+3nM. Assay description: Displacement of [3H]-5-CT from human 5HT7 receptor expressed in HEK293 cells measured after 1 hr by liquid scintillation counter method
Ligand InfoPC cidPC sid
In DepthDetails ArticlePubMed
TargetD(2) dopamine receptor(Homo sapiens (Human))
Polish Academy Of Sciences
Curated by ChEMBL
LigandPNGBDBM50513415(CHEMBL4435010)
Affinity DataKi:  1.20E+3nM. Assay description: Displacement of [3H]-methylspiperone from human D2 long receptor expressed in HEK293 cells measured after 1 hr by liquid scintillation counter method
Ligand InfoPC cidPC sid
In DepthDetails ArticlePubMed
Target5-hydroxytryptamine receptor 1A(Homo sapiens (Human))
Polish Academy Of Sciences
Curated by ChEMBL
LigandPNGBDBM50513415(CHEMBL4435010)
Affinity DataKi: >1.00E+4nM. Assay description: Displacement of [3H]-8-OH-DPAT from human 5HT1A receptor expressed in HEK293 cells incubated for 1 hr by liquid scintillation counter method
Ligand InfoPC cidPC sid
In DepthDetails ArticlePubMed