BDBM50515023 CHEMBL4561202
SMILES COc1ccc(OC)c(Cl)c1
InChI Key InChIKey=QMXZSRVFIWACJH-UHFFFAOYSA-N
Data  1 KI  1 EC50
  Tab Delimited (TSV)   2D SDfile   Computed 3D by Vconf -m prep SDfile
Find this compound or compounds like it in BindingDB:
Activity Spreadsheet -- Enzyme Inhibition Constant Data from BindingDB
Found 2 hits for monomerid = 50515023
TargetOxysterols receptor LXR-beta(Homo sapiens (Human))
Sun Yat-Sen University
Curated by ChEMBL
LigandPNGBDBM50515023(CHEMBL4561202)
Affinity DataKi:  4.76E+5nM. Assay description: Binding affinity to recombinant human LXRbeta-LBD expressed in Escherichia coli BL21 (DE3) assessed as inhibitory constant incubated for 30 mins by f...
In DepthDetails ArticlePubMed
TargetOxysterols receptor LXR-beta(Homo sapiens (Human))
Sun Yat-Sen University
Curated by ChEMBL
LigandPNGBDBM50515023(CHEMBL4561202)
Affinity DataEC50:  1.03E+6nM. Assay description: Agonist activity at recombinant human LXRbeta-LBD expressed in Escherichia coli BL21 (DE3) assessed as peptide D22 recruitment fluorescence polarizat...
In DepthDetails ArticlePubMed