BDBM50515030 CHEMBL4442070
SMILES CCOC(=O)c1cn2nc[nH]c(=O)c2c1C(C)C
InChI Key InChIKey=VTASDCRFXWOYNX-UHFFFAOYSA-N
Data  1 KI  1 EC50
  Tab Delimited (TSV)   2D SDfile   Computed 3D by Vconf -m prep SDfile
Find this compound or compounds like it in BindingDB:
Activity Spreadsheet -- Enzyme Inhibition Constant Data from BindingDB
Found 2 hits for monomerid = 50515030
TargetOxysterols receptor LXR-beta(Homo sapiens (Human))
Sun Yat-Sen University
Curated by ChEMBL
LigandPNGBDBM50515030(CHEMBL4442070)
Affinity DataKi:  1.40E+5nM. Assay description: Binding affinity to recombinant human LXRbeta-LBD expressed in Escherichia coli BL21 (DE3) assessed as inhibitory constant incubated for 30 mins by f...
In DepthDetails ArticlePubMed
TargetOxysterols receptor LXR-beta(Homo sapiens (Human))
Sun Yat-Sen University
Curated by ChEMBL
LigandPNGBDBM50515030(CHEMBL4442070)
Affinity DataEC50:  1.90E+4nM. Assay description: Agonist activity at recombinant human LXRbeta-LBD expressed in Escherichia coli BL21 (DE3) assessed as peptide D22 recruitment fluorescence polarizat...
In DepthDetails ArticlePubMed