BDBM50515533 CHEMBL4460514
SMILES CCCN(C(C(=O)NC1CCCCC1)c1ccc(C)cc1)C(=O)\C=C\C(=O)c1ccc(C)cc1
InChI Key InChIKey=WSLBLIIKNTWBOH-VHEBQXMUSA-N
Data  1 IC50
  Tab Delimited (TSV)   2D SDfile   Computed 3D by Vconf -m prep SDfile
Find this compound or compounds like it in BindingDB:
Activity Spreadsheet -- Enzyme Inhibition Constant Data from BindingDB
Found 1 hit for monomerid = 50515533
TargetThioredoxin reductase 1, cytoplasmic(Homo sapiens (Human))
University Of Belgrade
Curated by ChEMBL
LigandPNGBDBM50515533(CHEMBL4460514)
Affinity DataIC50:  8.16E+4nM. Assay description: Inhibition of TrxR in human SH-SY5Y cells using DTNB as substrate preincubated for 15 mins followed by substrate addition and measured for 20 mins by...
Ligand InfoPC cidPC sid
In DepthDetails ArticlePubMed