BDBM50518497 CHEMBL4594179
SMILES CCOC(=O)C1=C(C)Oc2nc(C)n(Cc3cn(nn3)[C@@H]3O[C@H](COC(C)=O)[C@@H](OC(C)=O)[C@H](OC(C)=O)[C@H]3OC(C)=O)c(=O)c2C1c1ccc(C)cc1
InChI Key InChIKey=ZJCNEMWGZCPHBA-PNVJSVLSSA-N
Data  1 KI
  Tab Delimited (TSV)   2D SDfile   Computed 3D by Vconf -m prep SDfile
Find this compound or compounds like it in BindingDB:
Activity Spreadsheet -- Enzyme Inhibition Constant Data from BindingDB
Found 1 hit for monomerid = 50518497
TargetTYR_PHOSPHATASE_2 domain-containing protein(Mycobacterium tuberculosis)
Vnu University Of Science
Curated by ChEMBL
LigandPNGBDBM50518497(CHEMBL4594179)
Affinity DataKi:  2.16E+3nM. Assay description: Competitive inhibition of Mycobacterium tuberculosis PTPB using varying levels of pNPP as substrate preincubated for 15 mins followed by substrate ad...
Ligand InfoPC cidPC sid
In DepthDetails ArticlePubMed