BDBM50519539 CHEMBL4476261
SMILES CNC(=O)c1cnc(NC(=O)C2CC2)cc1Nc1cccc(-c2ncn(C)n2)c1OC
InChI Key InChIKey=FYXUGQDHTWRPDY-UHFFFAOYSA-N
Data  4 IC50
  Tab Delimited (TSV)   2D SDfile   Computed 3D by Vconf -m prep SDfile
Find this compound or compounds like it in BindingDB:
Activity Spreadsheet -- Enzyme Inhibition Constant Data from BindingDB
Found 4 hits for monomerid = 50519539
TargetPotassium voltage-gated channel subfamily H member 2(Homo sapiens (Human))
TBA
Curated by ChEMBL
LigandPNGBDBM50519539(CHEMBL4476261)
Affinity DataIC50: >8.00E+4nM. Assay description: Inhibition of human ERG by in vitro patch clamp method
Ligand InfoPC cidPC sid
In DepthDetails ArticlePubMed
LigandPNGBDBM50519539(CHEMBL4476261)
Affinity DataIC50:  14nM. Assay description: Inhibition of JAK1/TYK2 in human Kit225 T cells assessed as inhibition of STAT phosphorylation by luciferase reporter assay
Ligand InfoPC cidPC sid
In DepthDetails ArticlePubMed
LigandPNGBDBM50519539(CHEMBL4476261)
Affinity DataIC50:  330nM. Assay description: Inhibition of TYK2 in mouse whole blood assessed as decrease in IFNalpha-induced STAT1 phosphorylation preincubated for 1 hr followed by stimulation ...
Ligand InfoPC cidPC sid
In DepthDetails ArticlePubMed
TargetNon-receptor tyrosine-protein kinase TYK2(Homo sapiens (Human))
TBA
Curated by ChEMBL
LigandPNGBDBM50519539(CHEMBL4476261)
Affinity DataIC50:  16nM. Assay description: Inhibition of TYK2 in human whole blood assessed as decrease in IFNalpha-induced STAT5 phosphorylation preincubated for 1 hr followed by stimulation ...
Ligand InfoPC cidPC sid
In DepthDetails ArticlePubMed