BDBM50521658 CHEMBL4542330
SMILES CSCC[C@H](NC(=O)[C@H](Cc1ccccc1)NC(=O)[C@H](CC(C)C)NC(=O)[C@H](CC(C)C)NC(=O)[C@H](C)NC(=O)[C@H](CC(N)=O)NC(=O)[C@@H](NC(=O)[C@H](Cc1cnc[nH]1)NC(=O)[C@H](CCCNC(N)=N)NC(=O)[C@@H](NC(=O)[C@H](CCCCN)NC(=O)[C@H](CCCNC(N)=N)NC(=O)[C@H](CC(C)C)NC(=O)[C@@H](N)C(C)C)[C@@H](C)O)C(C)C)C(=O)NCC(O)=O
InChI Key InChIKey=PWRYSSGQTNERMV-UQHCMDLHSA-N
Data  1 Kd
  Tab Delimited (TSV)   2D SDfile   Computed 3D by Vconf -m prep SDfile
Find this compound or compounds like it in BindingDB:
Activity Spreadsheet -- Enzyme Inhibition Constant Data from BindingDB
Found 1 hit for monomerid = 50521658
TargetSerine/threonine-protein kinase B-raf(Homo sapiens (Human))
University Of South Carolina
Curated by ChEMBL
LigandPNGBDBM50521658(CHEMBL4542330)
Affinity DataKd:  2.69E+3nM. Assay description: Binding affinity to BRAF (unknown origin) by intrinsic tryptophan fluorescence assay
Ligand InfoPC cidPC sid
In DepthDetails ArticlePubMed