BDBM50521928 CHEMBL4536835
SMILES CC(C)c1c(cnn1C)-c1nc(Nc2ccc(cn2)N2CCN(C)CC2)ncc1F
InChI Key InChIKey=UKSFDLFTRMYZGG-UHFFFAOYSA-N
Data  3 KI
  Tab Delimited (TSV)   2D SDfile   Computed 3D by Vconf -m prep SDfile
Find this compound or compounds like it in BindingDB:
Activity Spreadsheet -- Enzyme Inhibition Constant Data from BindingDB
Found 3 hits for monomerid = 50521928
TargetCyclin-dependent kinase 4/G1/S-specific cyclin-D3(Homo sapiens (Human))
Genentech
Curated by ChEMBL
LigandPNGBDBM50521928(CHEMBL4536835)
Affinity DataKi:  2.70nM. Assay description: Inhibition of human full length GST-tagged CDK4 (1 to 303(end) amino acids)/Cyclin D3 (1 to 292(end) amino acids) expressed in baculovirus expression...
Ligand InfoPC cidPC sid
In DepthDetails ArticlePubMed
TargetCyclin-dependent kinase 6/G1/S-specific cyclin-D3(Homo sapiens (Human))
Genentech
Curated by ChEMBL
LigandPNGBDBM50521928(CHEMBL4536835)
Affinity DataKi:  32nM. Assay description: Inhibition of human full length GST-tagged CDK6 (1 to 326(end) amino acids)/Cyclin D3 (1 to 292(end) amino acids) expressed in baculovirus expression...
Ligand InfoPC cidPC sid
In DepthDetails ArticlePubMed
TargetCyclin-A2/Cyclin-dependent kinase 1(Homo sapiens (Human))
Genentech
Curated by ChEMBL
LigandPNGBDBM50521928(CHEMBL4536835)
Affinity DataKi:  530nM. Assay description: Inhibition of human recombinant full length GST-tagged CDK1/Cyclin A2 expressed in sf9 insect cells assessed as inhibition constant using Ulight-4E-B...
Ligand InfoPC cidPC sid
In DepthDetails ArticlePubMed