BDBM50522285 CHEMBL4549109
SMILES [Na+].CCOP([O-])(=O)Cn1cnc(c1)-c1cccc(c1)-c1cccc(c1)C(=O)Nc1ncnc2nc[nH]c12
InChI Key InChIKey=KEMRPCYWDSBUSZ-UHFFFAOYSA-M
Data  4 KI
  Tab Delimited (TSV)   2D SDfile   Computed 3D by Vconf -m prep SDfile
Find this compound or compounds like it in BindingDB:
Activity Spreadsheet -- Enzyme Inhibition Constant Data from BindingDB
Found 4 hits for monomerid = 50522285
Target5'-nucleotidase(Homo sapiens (Human))
Universit£
Curated by ChEMBL
LigandPNGBDBM50522285(CHEMBL4549109)
Affinity DataKi:  5.36E+5nM. Assay description: Mixed type inhibition of recombinant cN-II (unknown origin) assessed as inhibitor constant for free enzyme using varying level of IMP as substrate by...
Ligand InfoPC cidPC sid
In DepthDetails ArticlePubMed
Target5'-nucleotidase(Homo sapiens (Human))
Universit£
Curated by ChEMBL
LigandPNGBDBM50522285(CHEMBL4549109)
Affinity DataKi:  5.82E+5nM. Assay description: Competitive inhibition of recombinant cN-II (unknown origin) using varying level of IMP as substrate by HPLC method based Lineweaver-Burk plot analys...
Ligand InfoPC cidPC sid
In DepthDetails ArticlePubMed
Target5'-nucleotidase(Homo sapiens (Human))
Universit£
Curated by ChEMBL
LigandPNGBDBM50522285(CHEMBL4549109)
Affinity DataKi:  1.35E+6nM. Assay description: Uncompetitive inhibition of recombinant cN-II (unknown origin) using varying level of IMP as substrate by HPLC method based Lineweaver-Burk plot anal...
Ligand InfoPC cidPC sid
In DepthDetails ArticlePubMed
Target5'-nucleotidase(Homo sapiens (Human))
Universit£
Curated by ChEMBL
LigandPNGBDBM50522285(CHEMBL4549109)
Affinity DataKi:  2.00E+6nM. Assay description: Noncompetitive inhibition of recombinant cN-II (unknown origin) using varying level of IMP as substrate by HPLC method based Lineweaver-Burk plot ana...
Ligand InfoPC cidPC sid
In DepthDetails ArticlePubMed